name.lastname,name.prefix,contact.mail,name.firstname,district,id,image.url,sex,contact.facebook,contact.phone,state,important,party,name.prettyname,salutation,image.copyright,team,contact.twitter,name.suffix
Amon,,werner.amon@parlament.gv.at,Werner,6,02819,/PAD_02819/4387252_180.jpg,male,,+43140126360,st,True,oevp,werner-amon,Sehr geehrter Abgeordneter,Parlamentsdirektion / PHOTO SIMONIS,spy,,MBA
Angerer,,,Erwin,2,84060,/PAD_84060/5226025_180.jpg,male,,+436643373650,k,False,fpoe,erwin-angerer,Sehr geehrter Abgeordneter,Parlamentsdirektion / PHOTO SIMONIS,unknown,,
Antoni,,konrad.antoni@parlament.gv.at,Konrad,3B,83107,/PAD_83107/4384844_180.jpg,male,,+436643459056,n,False,spoe,konrad-antoni,Sehr geehrter Abgeordneter,Parlamentsdirektion / PHOTO SIMONIS,spy,,
Aslan,Mag.,berivan.aslan@gruene.at,Aygül Berivan,7,83105,/PAD_83105/4384722_180.jpg,female,aslan.a.berivan,,t,False,gruene,ayguel-berivan-aslan,Sehr geehrte Abgeordnete,Parlamentsdirektion / PHOTO SIMONIS,liberty,Berivan_Aslan_,
Aubauer,Mag.,gertrude.aubauer@parlament.gv.at,Gertrude,B,35467,/PAD_35467/4413544_180.jpg,female,,+431401104693,w,False,oevp,gertrude-aubauer,Sehr geehrte Abgeordnete,Parlamentsdirektion / PHOTO SIMONIS,spy,,
Auer,,jakob.auer@parlament.gv.at,Jakob,4,00039,/PAD_00039/4444521_180.jpg,male,,+436643074635,o,False,oevp,jakob-auer,Sehr geehrter Abgeordneter,Parlamentsdirektion / PHOTO SIMONIS,spy,,
Bacher,,walter.bacher@parlament.gv.at,Walter,5C,83108,/PAD_83108/4385273_180.jpg,male,,,s,False,spoe,walter-bacher,Sehr geehrter Abgeordneter,Parlamentsdirektion / PHOTO SIMONIS,spy,,
Bayr,,petra.bayr@parlament.gv.at,Petra,9D,14835,/PAD_14835/4444987_180.jpg,female,,,w,False,spoe,petra-bayr,Sehr geehrte Abgeordnete,Parlamentsdirektion / PHOTO SIMONIS,spy,BayrPetra,MA
Becher,Mag.,ruth.becher@parlament.gv.at,Ruth,9G,14836,/PAD_14836/4445008_180.jpg,female,,+431401103586,w,False,spoe,ruth-becher,Sehr geehrte Abgeordnete,Parlamentsdirektion / PHOTO SIMONIS,spy,,
Belakowitsch-Jenewein,Dr.,dagmar.belakowitsch-jenewein@parlament.gv.at,Dagmar,9,35468,/PAD_35468/4387913_180.jpg,female,,+436641266012,w,False,fpoe,dagmar-belakowitsch-jenewein,Sehr geehrte Abgeordnete,Parlamentsdirektion / PHOTO SIMONIS,unknown,,
Berlakovich,Dipl.-Ing.,nikolaus.berlakovich@parlament.gv.at,Nikolaus,1,52688,/PAD_52688/5225964_180.jpg,male,,,b,False,oevp,nikolaus-berlakovich,Sehr geehrter Abgeordneter,Parlamentsdirektion / PHOTO SIMONIS,spy,,
Bernhard,,michael.pock@parlament.gv.at,Michael,9,83124,/PAD_83124/4380874_180.jpg,male,neos.pock,,w,False,neos,michael-bernhard,Sehr geehrter Abgeordneter,Parlamentsdirektion / PHOTO SIMONIS,liberty,michi_bernhard,
Bösch,Dr.,reinhard.boesch@fpoe.at,Reinhard Eugen,B,02867,/PAD_02867/4387764_180.jpg,male,,+436763349446,v,False,fpoe,reinhard-eugen-boesch,Sehr geehrter Abgeordneter,Parlamentsdirektion / PHOTO SIMONIS,unknown,,
Brosz,,dieter.brosz@gruene.at,Dieter,3,08239,/PAD_08239/4384460_180.jpg,male,,+431401106691,n,False,gruene,dieter-brosz,Sehr geehrter Abgeordneter,Parlamentsdirektion / PHOTO SIMONIS,liberty,,MSc
Brückl,,,Hermann,4B,61639,/PAD_61639/3487782_384.jpg,male,,,o,False,fpoe,hermann-brueckl,Sehr geehrter Abgeordneter,Parlamentsdirektion / PHOTO SIMONIS,unknown,,
Brunner,Mag.,christiane.brunner@parlament.gv.at,Christiane,B,51586,/PAD_51586/4384763_180.jpg,female,,+431401106303,b,False,gruene,christiane-brunner,Sehr geehrte Abgeordnete,Parlamentsdirektion / PHOTO SIMONIS,liberty,OekoBrunner,
Buchmayr,,h.buchmayr@aon.at,Harry,4B,63179,/PAD_63179/4384872_180.jpg,male,,,o,False,spoe,harry-buchmayr,Sehr geehrter Abgeordneter,Parlamentsdirektion / PHOTO SIMONIS,spy,,
Bures,,doris.bures@parlament.gv.at,Doris,9E,00145,/PAD_00145/5830576_180.jpg,female,,,w,False,spoe,doris-bures,Sehr geehrte Abgeordnete,Parlamentsdirektion / PHOTO SIMONIS,spy,,
Cap,Dr.,josef.cap@spoe.at,Josef,B,00178,/PAD_00178/3488817_384.jpg,male,,+431401103454,w,False,spoe,josef-cap,Sehr geehrter Abgeordneter,Parlamentsdirektion / WILKE,spy,,
Deimek,Dipl.-Ing.,gerhard.deimek@fpoe.at,Gerhard,4D,51557,/PAD_51557/4444818_180.jpg,male,,+431401107019,o,False,fpoe,gerhard-deimek,Sehr geehrter Abgeordneter,Parlamentsdirektion / PHOTO SIMONIS,unknown,GerhardDeimek,
Diesner-Wais,,martina.diesner-wais@parlament.gv.at,Martina,3B,16218,/PAD_16218/4386170_180.jpg,female,,+431401104687,n,False,oevp,martina-diesner-wais,Sehr geehrte Abgeordnete,Parlamentsdirektion / PHOTO SIMONIS,spy,,
Dietrich,Ing.,waltraud.dietrich@parlament.gv.at,Waltraud,6,83140,/PAD_83140/4386127_180.jpg,female,,+431401108025,st,False,frank,waltraud-dietrich,Sehr geehrte Abgeordnete,Parlamentsdirektion / PHOTO SIMONIS,spy,,
Doppelbauer,Dipl.-Ing.,karin.doppelbauer@parlament.gv.at,Karin,9,91141,/PAD_91141/6908260_180.jpg,female,,,w,False,neos,karin-doppelbauer,Sehr geehrte Abgeordnete,Parlamentsdirektion / PHOTO SIMONIS,liberty,DoppelbauerK,
Doppler,,rupert.doppler@parlament.gv.at,Rupert,5,51558,/PAD_51558/4838939_180.jpg,male,,,s,False,none,rupert-doppler,Sehr geehrter Abgeordneter,FPÖ Salzburg,spy,,
Durchschlag,,claudia.durchschlag@parlament.gv.at,Claudia,4A,40627,/PAD_40627/4386427_180.jpg,female,,+436764263025,o,False,oevp,claudia-durchschlag,Sehr geehrte Abgeordnete,Parlamentsdirektion / PHOTO SIMONIS,spy,,
Ecker,,cornelia.ecker@parlament.gv.at,Cornelia,5,83109,/PAD_83109/4385153_180.jpg,female,conny.ecker.spoe,,s,False,spoe,cornelia-ecker,Sehr geehrte Abgeordnete,Parlamentsdirektion / PHOTO SIMONIS,spy,,
El Habbassi,,,Asdin,B,83144,/PAD_83144/4386299_180.jpg,male,,,s,False,oevp,asdin-el-habbassi,Sehr geehrter Abgeordneter,Parlamentsdirektion / PHOTO SIMONIS,spy,asdin_elh,BA
Ertlschweiger,,rouven.ertlschweiger@parlament.gv.at,Rouven,B,83433,/PAD_83433/4582543_384.jpg,male,Ertlschweiger.Rouven,+431401104400,n,False,oevp,rouven-ertlschweiger,Sehr geehrter Abgeordneter,Parlamentsdirektion / PHOTO SIMONIS,spy,,MSc
Eßl,,franz.essl@parlament.gv.at,Franz Leonhard,5C,14755,/PAD_14755/4386828_180.jpg,male,,,s,False,oevp,franz-leonhard-essl,Sehr geehrter Abgeordneter,Parlamentsdirektion / PHOTO SIMONIS,spy,,
Feichtinger,Mag. Dr.,klaus-uwe.feichtinger@parlament.gv.at,Klaus Uwe,6B,83298,/PAD_83298/4582572_384.jpg,male,,+436644558910,st,False,spoe,klaus-uwe-feichtinger,Sehr geehrter Abgeordneter,Parlamentsdirektion / PHOTO SIMONIS,spy,spoestmk,
Fekter,Mag. Dr.,maria.fekter@parlament.gv.at,Maria Theresia,4C,00311,/PAD_00311/4387369_180.jpg,female,,+431401104682,o,False,oevp,maria-theresia-fekter,Sehr geehrte Abgeordnete,Parlamentsdirektion / PHOTO SIMONIS,spy,,
Fichtinger,,angela.fichtinger@parlament.gv.at,Angela,3B,83146,/PAD_83146/4386378_180.jpg,female,angela.fichtinger,,n,False,oevp,angela-fichtinger,Sehr geehrte Abgeordnete,Parlamentsdirektion / PHOTO SIMONIS,spy,,
Franz,Dr.,marcus.franz@parlament.gv.at,Marcus,B,83141,/PAD_83141/4385896_180.jpg,male,,,w,False,none,marcus-franz,Sehr geehrter Abgeordneter,Parlamentsdirektion / PHOTO SIMONIS,spy,MD_Franz,
Fuchs,MMag. DDr.,hubert.fuchs@parlament.gv.at,Hubert,B,83127,/PAD_83127/4387467_180.jpg,male,,,s,False,fpoe,hubert-fuchs,Sehr geehrter Abgeordneter,Parlamentsdirektion / PHOTO SIMONIS,unknown,,
Gahr,,hermann.gahr@parlament.gv.at,Hermann,7B,08209,/PAD_08209/4387081_180.jpg,male,,,t,False,oevp,hermann-gahr,Sehr geehrter Abgeordneter,Parlamentsdirektion / PHOTO SIMONIS,spy,,
Gamon,,claudia.gamon@neos.eu,Claudia Angela,B,86976,/PAD_86976/6006189_180.jpg,female,cgamon,,w,False,neos,claudia-angela-gamon,Sehr geehrte Abgeordnete,Parlamentsdirektion / PHOTO SIMONIS,liberty,dieGamon,MSc
Gerstl,Mag.,wolfgang.gerstl@oevp-wien.at,Wolfgang,B,67199,/PAD_67199/4386512_180.jpg,male,wgerstl,,w,False,oevp,wolfgang-gerstl,Sehr geehrter Abgeordneter,Parlamentsdirektion / PHOTO SIMONIS,spy,wolfganggerstl,
Gessl-Ranftl,,andrea.gessl-ranftl@aon.at,Andrea,6D,51527,/PAD_51527/4385218_180.jpg,female,,,st,False,spoe,andrea-gessl-ranftl,Sehr geehrte Abgeordnete,Parlamentsdirektion / PHOTO SIMONIS,spy,,
Glawischnig-Piesczek,Dr.,eva.glawischnig@gruene.at,Eva,9,08240,/PAD_08240/4582273_384.jpg,female,,,w,False,gruene,eva-glawischnig-piesczek,Sehr geehrte Abgeordnete,Parlamentsdirektion / PHOTO SIMONIS,liberty,,
Greiner,Mag.,,Karin,B,80479,/PAD_80479/4582473_384.jpg,female,,,st,False,spoe,karin-greiner,Sehr geehrte Abgeordnete,Parlamentsdirektion / PHOTO SIMONIS,spy,,
Grillitsch,,,Fritz,6D,12907,/PAD_12907/5225943_180.jpg,male,,,st,False,oevp,fritz-grillitsch,Sehr geehrter Abgeordneter,Parlamentsdirektion / PHOTO SIMONIS,spy,,
Groiß,Ing. Mag.,werner.groiss@parlament.gv.at,Werner,3,83147,/PAD_83147/4386211_180.jpg,male,,,n,False,oevp,werner-groiss,Sehr geehrter Abgeordneter,Parlamentsdirektion / PHOTO SIMONIS,spy,,
Grossmann,Mag.,elisabeth.grossmann@parlament.gv.at,Elisabeth,6,14839,/PAD_14839/4385324_180.jpg,female,,+431401103726,st,False,spoe,elisabeth-grossmann,Sehr geehrte Abgeordnete,Parlamentsdirektion / PHOTO SIMONIS,spy,GrossmannSissi,
Gusenbauer-Jäger,,,Marianne,4E,83110,/PAD_83110/4384958_180.jpg,female,,+4315854544,o,False,spoe,marianne-gusenbauer-jaeger,Sehr geehrte Abgeordnete,Parlamentsdirektion / PHOTO SIMONIS,spy,,
Hable,Dr.,rainer.hable@parlament.gv.at,Rainer,4,83120,/PAD_83120/4380832_180.jpg,male,rainerhable.eu,,o,False,neos,rainer-hable,Sehr geehrter Abgeordneter,Parlamentsdirektion / PHOTO SIMONIS,liberty,RainerHable,
Hafenecker,,christian.hafenecker@parlament.gv.at,Christian,3D,78586,/PAD_78586/4444584_180.jpg,male,,,n,False,fpoe,christian-hafenecker,Sehr geehrter Abgeordneter,Parlamentsdirektion / PHOTO SIMONIS,unknown,hafi1980,MA
Hagen,,christoph.hagen@parlament.gv.at,Christoph,B,08256,/PAD_08256/4386149_180.jpg,male,,,v,False,frank,christoph-hagen,Sehr geehrter Abgeordneter,Parlamentsdirektion / PHOTO SIMONIS,spy,NR_Hagen,
Haider,Mag.,roman.haider@parlament.gv.at,Roman,4,51560,/PAD_51560/4445156_180.jpg,male,,+431401107027,o,False,fpoe,roman-haider,Sehr geehrter Abgeordneter,Parlamentsdirektion / PHOTO SIMONIS,unknown,,
Hakel,,elisabeth.hakel@parlament.gv.at,Elisabeth,B,10256,/PAD_10256/4473430_180.jpg,female,,+431401101471,st,False,spoe,elisabeth-hakel,Sehr geehrte Abgeordnete,Parlamentsdirektion / PHOTO SIMONIS,spy,ElisabethHakel,
Hammer,Mag.,michael.hammer@parlament.gv.at,Michael,4E,55227,/PAD_55227/5225905_384.jpg,male,,,o,False,oevp,michael-hammer,Sehr geehrter Abgeordneter,Parlamentsdirektion / PHOTO SIMONIS,spy,,
Hanger,Mag.,mail@andreas-hanger.at,Andreas,3C,83148,/PAD_83148/5225861_180.jpg,male,,,n,False,oevp,andreas-hanger,Sehr geehrter Abgeordneter,Parlamentsdirektion / PHOTO SIMONIS,spy,Andreas_Hanger,
Haubner,,p.haubner@wirtschaftsbund.at,Peter,5B,12741,/PAD_12741/4386616_180.jpg,male,,,s,False,oevp,peter-haubner,Sehr geehrter Abgeordneter,Parlamentsdirektion / PHOTO SIMONIS,spy,,
Hauser,Mag.,gerald.hauser@parlament.gv.at,Gerald,7,35515,/PAD_35515/4387596_180.jpg,male,,,t,False,fpoe,gerald-hauser,Sehr geehrter Abgeordneter,Parlamentsdirektion / PHOTO SIMONIS,unknown,,
Hechtl,,johann.hechtl@parlament.gv.at,Johann,3,51547,/PAD_51547/4385362_180.jpg,male,,,n,False,spoe,johann-hechtl,Sehr geehrter Abgeordneter,Parlamentsdirektion / PHOTO SIMONIS,spy,,
Heinisch-Hosek,,gabriele.heinisch-hosek@parlament.gv.at,Gabriele,3,08177,/PAD_08177/6401592_180.jpg,female,,,n,False,spoe,gabriele-heinisch-hosek,Sehr geehrte Abgeordnete,Parlamentsdirektion / PHOTO SIMONIS,spy,heinischhosek,
Heinzl,,anton.heinzl@spoe.at,Anton,3D,05076,/PAD_05076/4385474_180.jpg,male,,,n,False,spoe,anton-heinzl,Sehr geehrter Abgeordneter,Parlamentsdirektion / PHOTO SIMONIS,spy,,
Hell,,johann.hell@spoe.at,Johann,3,50187,/PAD_50187/4385131_180.jpg,male,,,n,False,spoe,johann-hell,Sehr geehrter Abgeordneter,Parlamentsdirektion / PHOTO SIMONIS,spy,JohannHell,
Himmelbauer,,eva-maria.himmelbauer@parlament.gv.at,Eva-Maria,3A,72959,/PAD_72959/4386704_180.jpg,female,eva.himmelbauer,,n,True,oevp,eva-maria-himmelbauer,Sehr geehrte Abgeordnete,Parlamentsdirektion / PHOTO SIMONIS,unknown,EHimmelbauer,BSc
Höbart,Ing.,christian.hoebart@fpoe.at,Christian,3,51562,/PAD_51562/4444669_180.jpg,male,,,n,False,fpoe,christian-hoebart,Sehr geehrter Abgeordneter,Parlamentsdirektion / PHOTO SIMONIS,unknown,Hoebi75,
Hofer,Ing.,norbert.hofer@parlament.gv.at,Norbert,1,35521,/PAD_35521/4444542_180.jpg,male,,,b,False,fpoe,norbert-hofer,Sehr geehrter Abgeordneter,Parlamentsdirektion / PHOTO SIMONIS,unknown,norbertghofer,
Hofinger,Ing.,manfred.hofinger@parlament.gv.at,Manfred,4,83299,/PAD_83299/4582361_384.jpg,male,,,o,False,oevp,manfred-hofinger,Sehr geehrter Abgeordneter,Parlamentsdirektion / PHOTO SIMONIS,spy,,
Höfinger,,johann.hoefinger@parlament.gv.at,Johann,3D,16234,/PAD_16234/4386933_180.jpg,male,,,n,False,oevp,johann-hoefinger,Sehr geehrter Abgeordneter,Parlamentsdirektion / PHOTO SIMONIS,spy,,
Holzinger-Vogtenhuber,,daniela.holzinger@parlament.gv.at,Daniela,4C,83111,/PAD_83111/4384894_180.jpg,female,daniela.holzinger.3,,o,False,spoe,daniela-holzinger-vogtenhuber,Sehr geehrte Abgeordnete,Parlamentsdirektion / PHOTO SIMONIS,spy,DanielaNRW13,BA
Huainigg,Dr.,franz.huainigg@parlament.gv.at,Franz-Joseph,B,14759,/PAD_14759/4582252_384.jpg,male,,+431401104647,w,False,oevp,franz-joseph-huainigg,Sehr geehrter Abgeordneter,Parlamentsdirektion / PHOTO SIMONIS,spy,,
Hübner,Dr.,johannes.huebner@parlament.gv.at,Johannes,9E,51561,/PAD_51561/4387889_180.jpg,male,,,w,False,fpoe,johannes-huebner,Sehr geehrter Abgeordneter,Parlamentsdirektion / PHOTO SIMONIS,unknown,,
Jank,,brigitte.jank@parlament.gv.at,Brigitte,9,83149,/PAD_83149/4386406_180.jpg,female,,+431401104678,w,False,oevp,brigitte-jank,Sehr geehrte Abgeordnete,Parlamentsdirektion / PHOTO SIMONIS,spy,,
Jannach,,harald.jannach@fpoe.at,Harald,B,51563,/PAD_51563/4387659_180.jpg,male,,,k,False,fpoe,harald-jannach,Sehr geehrter Abgeordneter,Parlamentsdirektion / PHOTO SIMONIS,unknown,,
Jarmer,Mag.,helene.jarmer@gruene.at,Helene,B,57367,/PAD_57367/4384392_180.jpg,female,Abg.Helene.Jarmer,,w,False,gruene,helene-jarmer,Sehr geehrte Abgeordnete,Parlamentsdirektion / PHOTO SIMONIS,liberty,hjarmer,
Jarolim,Dr.,hannes.jarolim@parlament.gv.at,Johannes,9C,02889,/PAD_02889/4445093_180.jpg,male,,+431401103729,w,True,spoe,johannes-jarolim,Sehr geehrter Abgeordneter,Parlamentsdirektion / PHOTO SIMONIS,unknown,,
Karl,Mag. Dr.,beatrix.karl@parlament.gv.at,Beatrix,6,35490,/PAD_35490/4386742_180.jpg,female,,+431401104628,st,False,oevp,beatrix-karl,Sehr geehrte Abgeordnete,Parlamentsdirektion / PHOTO SIMONIS,spy,,
Karlsböck,Dr.,andreas.karlsboeck@parlament.gv.at,Andreas,9D,51564,/PAD_51564/4444648_180.jpg,male,,,w,False,fpoe,andreas-karlsboeck,Sehr geehrter Abgeordneter,Parlamentsdirektion / PHOTO SIMONIS,unknown,,
Kassegger,MMMag. Dr.,axel.kassegger@parlament.gv.at,Axel,6,83129,/PAD_83129/4387514_180.jpg,male,,,st,False,fpoe,axel-kassegger,Sehr geehrter Abgeordneter,Parlamentsdirektion / PHOTO SIMONIS,unknown,,
Katzian,,wolfgang.katzian@parlament.gv.at,Wolfgang,B,32494,/PAD_32494/3490712_384.jpg,male,,+43676817111010,w,False,spoe,wolfgang-katzian,Sehr geehrter Abgeordneter,Parlamentsdirektion / WILKE,spy,GPAdjp,
Keck,,,Dietmar,4A,14840,/PAD_14840/4385790_180.jpg,male,,,o,False,spoe,dietmar-keck,Sehr geehrter Abgeordneter,Parlamentsdirektion / PHOTO SIMONIS,spy,,
Kickl,,herbert.kickl@parlament.gv.at,Herbert,B,35520,/PAD_35520/4444860_180.jpg,male,,+431512353525,w,False,fpoe,herbert-kickl,Sehr geehrter Abgeordneter,Parlamentsdirektion / PHOTO SIMONIS,unknown,,
Kirchgatterer,,franz.kirchgatterer@parlament.gv.at,Franz,4C,35495,/PAD_35495/4385706_180.jpg,male,,,o,False,spoe,franz-kirchgatterer,Sehr geehrter Abgeordneter,Parlamentsdirektion / PHOTO SIMONIS,spy,,
Kitzmüller,,anneliese.kitzmueller@parlament.gv.at,Anneliese,4E,51565,/PAD_51565/4387679_180.jpg,female,,+431401107027,o,False,fpoe,anneliese-kitzmueller,Sehr geehrte Abgeordnete,Parlamentsdirektion / PHOTO SIMONIS,unknown,,
Klinger,Ing.,,Wolfgang,4C,88857,/PAD_88857/6567303_180.jpg,male,,+436641007029,o,False,fpoe,wolfgang-klinger,Sehr geehrter Abgeordneter,Parlamentsdirektion / PHOTO SIMONIS,unknown,,
Klug,Mag.,,Gerald,6A,30036,/PAD_30036/6401454_384.jpg,male,,+431401103466,st,False,spoe,gerald-klug,Sehr geehrter Abgeordneter,Parlamentsdirektion / PHOTO SIMONIS,spy,,
Knes,,wolfgang.knes@parlament.gv.at,Wolfgang,2D,83112,/PAD_83112/4385750_180.jpg,male,,,k,False,spoe,wolfgang-knes,Sehr geehrter Abgeordneter,Parlamentsdirektion / PHOTO SIMONIS,spy,,
Köchl,,matthias.koechl@parlament.gv.at,Matthias,2,83100,/PAD_83100/4384591_180.jpg,male,koechl.eu,,k,False,gruene,matthias-koechl,Sehr geehrter Abgeordneter,Parlamentsdirektion / PHOTO SIMONIS,liberty,matthiaskoechl,
Kogler,Mag.,werner.kogler@gruene.at,Werner,6,08242,/PAD_08242/3490465_384.jpg,male,,+431401106700,st,False,gruene,werner-kogler,Sehr geehrter Abgeordneter,Parlamentsdirektion / WILKE,liberty,wkogler,
Königsberger-Ludwig,,ulrike.koenigsberger-ludwig@parlament.gv.at,Ulrike,3C,14841,/PAD_14841/4385811_180.jpg,female,UlrikeKonigsbergerLudwig,,n,False,spoe,ulrike-koenigsberger-ludwig,Sehr geehrte Abgeordnete,Parlamentsdirektion / PHOTO SIMONIS,spy,,
Kopf,,karlheinz.kopf@parlament.gv.at,Karlheinz,8,02822,/PAD_02822/4405723_180.jpg,male,karlheinzkopf,+431401104400,v,False,oevp,karlheinz-kopf,Sehr geehrter Abgeordneter,Parlamentsdirektion / PHOTO SIMONIS,spy,,
Korun,Mag.,alev.korun@gruene.at,Alev,9,51587,/PAD_51587/4384700_180.jpg,female,,+431401106301,w,False,gruene,alev-korun,Sehr geehrte Abgeordnete,Parlamentsdirektion / PHOTO SIMONIS,liberty,AlevKorun,
Krainer,,jan.krainer@spoe.at,Kai Jan,9,14842,/PAD_14842/4582232_384.jpg,male,,+431401103719,w,False,spoe,kai-jan-krainer,Sehr geehrter Abgeordneter,Parlamentsdirektion / PHOTO SIMONIS,spy,,
Krist,,,Hermann,4A,14843,/PAD_14843/4468385_180.jpg,male,,+431401103661,o,False,spoe,hermann-krist,Sehr geehrter Abgeordneter,Parlamentsdirektion / PHOTO SIMONIS,spy,,
Kucharowits,,katharina.kucharowits@parlament.gv.at,Katharina,B,35908,/PAD_35908/4384979_180.jpg,female,kucharowits,,n,False,spoe,katharina-kucharowits,Sehr geehrte Abgeordnete,Parlamentsdirektion / PHOTO SIMONIS,unknown,kathi_kuch,
Kucher,,philip.kucher@parlament.gv.at,Philip,2A,83113,/PAD_83113/4385832_180.jpg,male,philip.kucher,+436648521330,k,False,spoe,philip-kucher,Sehr geehrter Abgeordneter,Parlamentsdirektion / PHOTO SIMONIS,unknown,philipkucher,
Kumpitsch,Mag.,,Günther,6A,86603,/PAD_86603/5814774_180.jpg,male,,,st,False,fpoe,guenther-kumpitsch,Sehr geehrter Abgeordneter,Privat,unknown,,
Kuntzl,Mag.,andrea.kuntzl@spoe.at,Andrea,9,08178,/PAD_08178/3491279_384.jpg,female,,+431401103654,w,False,spoe,andrea-kuntzl,Sehr geehrte Abgeordnete,Parlamentsdirektion / WILKE,spy,,
Lasar,,david.lasar@fpoe.at,David,9G,88823,/PAD_88823/6567366_180.jpg,male,,,w,False,fpoe,david-lasar,Sehr geehrter Abgeordneter,Parlamentsdirektion / PHOTO SIMONIS,unknown,,
Lausch,,christian.lausch@parlament.gv.at,Christian,3,51568,/PAD_51568/4444500_180.jpg,male,,,n,False,fpoe,christian-lausch,Sehr geehrter Abgeordneter,Parlamentsdirektion / PHOTO SIMONIS,unknown,,
Lettenbichler,Mag.,josef.lettenbichler@parlament.gv.at,Josef,7C,51553,/PAD_51553/4386764_180.jpg,male,,+431401104574,t,False,oevp,josef-lettenbichler,Sehr geehrter Abgeordneter,Parlamentsdirektion / PHOTO SIMONIS,spy,,
Lichtenecker,Dr.,ruperta.lichtenecker@gruene.at,Ruperta,4,18447,/PAD_18447/3490769_384.jpg,female,,+431401106730,o,False,gruene,ruperta-lichtenecker,Sehr geehrte Abgeordnete,Parlamentsdirektion / WILKE,liberty,RLichtenecker,
Lintl,Dr.,jessi.lintl@parlament.gv.at,Jessi,9,83142,/PAD_83142/4385959_180.jpg,female,,,w,False,fpoe,jessi-lintl,Sehr geehrte Abgeordnete,Parlamentsdirektion / PHOTO SIMONIS,unknown,jessilintl,
Lipitsch,,hermann.lipitsch@parlament.gv.at,Hermann,2B,51548,/PAD_51548/4385066_180.jpg,male,,,k,False,spoe,hermann-lipitsch,Sehr geehrter Abgeordneter,Parlamentsdirektion / PHOTO SIMONIS,spy,HLipitsch,
Loacker,Mag.,gerald.loacker@parlament.gv.at,Gerald,8,83121,/PAD_83121/4380811_180.jpg,male,GLoacker.NEOS,,v,False,neos,gerald-loacker,Sehr geehrter Abgeordneter,Parlamentsdirektion / PHOTO SIMONIS,liberty,GLoacker,
Lopatka,Dr.,reinhold.lopatka@oevpklub.at,Reinhold,6B,15526,/PAD_15526/4387318_180.jpg,male,reinhold.lopatka,,st,False,oevp,reinhold-lopatka,Sehr geehrter Abgeordneter,Parlamentsdirektion / PHOTO SIMONIS,spy,ReinholdLopatka,
Lueger,,angela.lueger@parlament.gv.at,Angela,9G,22449,/PAD_22449/4385411_180.jpg,female,,,w,False,spoe,angela-lueger,Sehr geehrte Abgeordnete,Parlamentsdirektion / PHOTO SIMONIS,spy,,
Lugar,Ing.,robert.lugar@parlament.gv.at,Robert,3,51579,/PAD_51579/4385980_180.jpg,male,,,n,False,frank,robert-lugar,Sehr geehrter Abgeordneter,Parlamentsdirektion / PHOTO SIMONIS,spy,LugarRobert,
Matznetter,Dr.,christoph.matznetter@parlament.gv.at,Christoph,B,14844,/PAD_14844/5225985_180.jpg,male,,+431401103741,w,False,spoe,christoph-matznetter,Sehr geehrter Abgeordneter,Parlamentsdirektion / PHOTO SIMONIS,spy,,
Maurer,,sigi.maurer@gruene.at,Sigrid,B,83101,/PAD_83101/4384301_180.jpg,female,sigrid.maurer,,t,False,gruene,sigrid-maurer,Sehr geehrte Abgeordnete,Parlamentsdirektion / PHOTO SIMONIS,liberty,sigi_maurer,
Mayer,,elmar.mayer@spoe.at,Elmar,8,35501,/PAD_35501/4385596_180.jpg,male,,,v,False,spoe,elmar-mayer,Sehr geehrter Abgeordneter,Parlamentsdirektion / PHOTO SIMONIS,spy,,
Mölzer,,wendelin.moelzer@parlament.gv.at,Wendelin,2,36187,/PAD_36187/4387575_180.jpg,male,wendelin.moelzer,,k,False,fpoe,wendelin-moelzer,Sehr geehrter Abgeordneter,Parlamentsdirektion / PHOTO SIMONIS,unknown,wendemoelzer,
Moser,Dr.,gabriela.moser@gruene.at,Gabriela,4A,02853,/PAD_02853/4384678_180.jpg,female,,+431401106556,o,False,gruene,gabriela-moser,Sehr geehrte Abgeordnete,Parlamentsdirektion / PHOTO SIMONIS,liberty,Gabi_Moser,
Muchitsch,,josef.muchitsch@parlament.gv.at,Josef,6C,35497,/PAD_35497/4582613_384.jpg,male,,+431401103764,st,False,spoe,josef-muchitsch,Sehr geehrter Abgeordneter,Parlamentsdirektion / PHOTO SIMONIS,spy,,
Mückstein,Dr.,eva.mueckstein@gruene.at,Eva,3,83102,/PAD_83102/5225818_180.jpg,female,eva.muckstein,,n,False,gruene,eva-mueckstein,Sehr geehrte Abgeordnete,Parlamentsdirektion / PHOTO SIMONIS,liberty,salome712,
Mühlberghuber,,edith.muehlberghuber@parlament.gv.at,Edith,3C,51569,/PAD_51569/4444711_180.jpg,female,,,n,False,fpoe,edith-muehlberghuber,Sehr geehrte Abgeordnete,Parlamentsdirektion / PHOTO SIMONIS,unknown,,
Muttonen,Mag.,christine.muttonen@parlament.gv.at,Christine,2,08179,/PAD_08179/3567270_384.jpg,female,,+431401103660,k,False,spoe,christine-muttonen,Sehr geehrte Abgeordnete,Parlamentsdirektion / WILKE,spy,,
Nachbaur,Dr.,kathrin.nachbaur@parlament.gv.at,Kathrin,B,83139,/PAD_83139/4386042_180.jpg,female,,+431401104628,st,False,oevp,kathrin-nachbaur,Sehr geehrte Abgeordnete,Parlamentsdirektion / PHOTO SIMONIS,spy,,
Neubauer,,werner.neubauer@fpoe.at,Werner,B,35522,/PAD_35522/4387828_180.jpg,male,,,o,False,fpoe,werner-neubauer,Sehr geehrter Abgeordneter,Parlamentsdirektion / PHOTO SIMONIS,unknown,,
Obernosterer,,gabriel.obernosterer@parlament.gv.at,Gabriel,2,35487,/PAD_35487/4386958_180.jpg,male,,+431401104691,k,False,oevp,gabriel-obernosterer,Sehr geehrter Abgeordneter,Parlamentsdirektion / PHOTO SIMONIS,spy,G_Obernosterer,
Ofenauer,Mag.,friedrich.ofenauer@parlament.gv.at,Friedrich,3,83300,/PAD_83300/4582315_384.jpg,male,,,n,False,oevp,friedrich-ofenauer,Sehr geehrter Abgeordneter,Parlamentsdirektion / PHOTO SIMONIS,spy,fritzof,
Öllinger,,karl.oellinger@gruene.at,Karl,9,02854,/PAD_02854/6347436_180.jpg,male,karloellinger,,w,False,gruene,karl-oellinger,Sehr geehrter Abgeordneter,Parlamentsdirektion / PHOTO SIMONIS,liberty,,
Ottenschläger,,andreas.ottenschlaeger@parlament.gv.at,Andreas,9,83150,/PAD_83150/4386257_180.jpg,male,,+431401104655,w,False,oevp,andreas-ottenschlaeger,Sehr geehrter Abgeordneter,Parlamentsdirektion / PHOTO SIMONIS,spy,,
Pendl,,otto.pendl@parlament.gv.at,Otto,3G,05375,/PAD_05375/4385016_180.jpg,male,,,n,True,spoe,otto-pendl,Sehr geehrter Abgeordneter,Parlamentsdirektion / PHOTO SIMONIS,unknown,otto_pendl,